☰
多通道DDR4读写控制:FPGA仲裁与AXI4接口实战
2026/10/20 12:22:14 网站建设 项目流程

简介:一套基于Xilinx FPGA的多通道DDR4读写控制完整工程,面向数字逻辑设计工程师、FPGA学习者和高速存储接口研究者,以解决多通道DDR4高效读写控制与工程实现问题为目标。压缩包约235.49MB,共1351个文件,以.v/.sv/.vhd等HDL源文件为主,辅以XDC约束文件、do/sh/tcl脚本及Vivado工程文件,便于直接打开与仿真综合。已有7100余人浏览学习,适合用于课程设计、项目原型参考及高速存储相关开发。核心模块基于AXI接口实现四通道DDR4读写控制器,通道数可参数化配置,包含地址、命令、数据及时钟管理逻辑,并配套时序约束与硬件验证。整体基于Vivado 2018.2开发,涵盖DDR4控制器常用架构和多通道并发访问优化思路,对理解DDR4协议、AXI总线交互和片上系统设计有较高参考价值。

1. 多通道 DDR4 读写控制:从「能读能写」到「能同时跑满四路」

做图像采集加速的时候,四路高清视频同时往 DDR4 里灌数据,单通道读写明明正常,一旦四路并发,带宽直接掉到四成。问题不出在 DDR4 颗粒本身,而在多通道时序协调——Xilinx 的 MIG IP 帮你管好了颗粒侧的刷新、预充电和时序训练,但用户侧那套 AXI4 接口怎么接收四路请求、怎么仲裁、怎么把乱序回来的读数据还给对应的发起方,全部要自己写。这套「基于 Xilinx FPGA 的多通道 DDR4 读写控制模块」就是把这一层补齐的完整工程,适合做视频缓存、高速采集、数据预处理加速的开发者直接拿去改,也适合刚接触 FPGA DDR4 控制的人把它当一份带仿真和上板验证的实战参考。

2. 整体架构设计:MIG 之外的那一半工作量

2.1 模块总览:用户逻辑和 DDR4 物理层之间到底隔了几层

很多人第一次调 DDR4,以为例化一个 MIG IP 就万事大吉。实际上 MIG 只解决了两件事:一是把 DDR4 颗粒要求的时序训练、刷新、预充电、bank 管理这些敏感操作封装成黑匣子;二是对外暴露一个标准的 AXI4 从端接口。用户逻辑要读写数据,本质是在跟这个 AXI4 从端打交道,而多通道场景下,真正的工作量全在 AXI4 这一侧。

这个工程在 MIG 之上加了三层逻辑:

  • 通道适配层:把每个用户通道的读写请求转换成统一的命令描述符,进入命令缓冲。
  • 仲裁调度层:多通道命令按策略仲裁,决定当前周期谁的命令能进 MIG 的命令队列。
  • 数据通路层:写数据按仲裁结果路由到 MIG 的写通道,读返回数据按 tag 区分送回对应的用户通道。

整个链路里,MIG 提供的是物理层和协议层的确定性,而用户能改的、需要改的,就是这三层。工程里用了一个四通道的配置,数据位宽、突发长度、仲裁方式都是可调参数,后面讲核心代码时会逐一说明。

2.2 工程目录结构:src、sim、xdc、ip 各放什么

拿到工程后先别急着开 Vivado,把目录看一遍心里就有数了。

fpga_ddr4_multi_ch/ ├── src/ # RTL 源码 │ ├── top.v # 顶层,例化 MIG 和用户逻辑 │ ├── arbiter.sv # 轮询仲裁器 │ ├── cmd_fifo.sv # 命令描述符缓冲 │ ├── wr_data_path.sv # 写数据通路 │ ├── rd_data_path.sv # 读数据通路与 tag 管理 │ └── cdc_sync.sv # 跨时钟域同步 ├── sim/ │ ├── tb_top.sv # 顶层测试平台 │ ├── tb_traffic_gen.sv # 多通道流量生成 │ └── test_bench.log # 参考运行日志 ├── constr/ │ ├── top.xdc # 引脚约束 │ ├── timing.xdc # 时钟与时序例外 │ └── debug.xdc # ILA 调试约束 ├── ip/ │ ├── mig_7series.xci # MIG IP 配置 │ └── clk_wiz.xci # 用户时钟生成 ├── scripts/ │ ├── create_project.tcl # 一键建工程 │ └── run_sim.tcl # 仿真脚本 └── docs/ └── register_map.md # 寄存器说明

这个结构是按「可回归、可复现」组织的。src 里 RTL 和仿真分开,xdc 拆成了引脚、时序、调试三个文件,这样上板调试时只加 debug.xdc,不影响正式约束。scripts 下的 tcl 脚本保证换一台机器或换一个 Vivado 版本也能一键重建工程,后面第 4 章会讲怎么用。

2.3 关键设计决策:为什么仲裁用轮询而不是优先级

多通道 DDR4 控制最容易翻车的地方是仲裁策略。很多人下意识用优先级仲裁,高优先级通道永远先走,结果低优先级通道饥饿,更麻烦的是优先级高的通道如果突发很长,DDR4 的 bank 被它占满,其他通道的 row 命中率骤降,总带宽反而变差。这个工程用的是轮询仲裁(round-robin),四个通道轮流获得发送机会,配合较短的 burst 长度,让 MIG 的 bank 调度器有机会重排访问,实际跑下来整体带宽比固定优先级高不少。

轮询之外还有一个细节:命令仲裁和写数据仲裁必须联动。命令通道选了 ch0,写数据通道也得切到 ch0,否则数据对不上。这个工程里命令通道和写数据通道用的是同一个仲裁结果,读返回通道则是靠 tag 来区分,不参与仲裁。

3. 核心代码拆解:命令仲裁与读写数据通道的实现

3.1 命令描述符:把读和写统一成一种格式

多通道并发访问最容易出现的问题是读写交叉时命令通道和数据通道互相等待。这个工程把读写请求统一成命令描述符,仲裁器只调度描述符,不管数据本身,这样数据通路可以流水化处理。

系统定义了一个 96 位的命令描述符,按下面的格式打包:

// cmd_desc: [95:94] channel_id [93:92] cmd_type [91:64] start_addr [63:32] byte_len [31:0] tag localparam CH_WIDTH = 2; // 4 通道,2 bit 足够 localparam CMD_W = 96; typedef struct packed { logic [1:0] ch_id; // 通道号 0~3 logic [1:0] cmd_type; // 2'b00: WR 2'b01: RD logic [27:0] start_addr; // 按 16 Byte 对齐的起始地址 logic [31:0] byte_len; // 突发总字节数,最大 4K logic [31:0] tag; // 读请求标志,用于读返回路由 } cmd_desc_t;

这个描述符在用户通道的时钟域里生成,写入命令 FIFO,仲裁器从 FIFO 尾部弹出描述符并仲裁。tag 是读请求的关键——多通道乱序返回时,MIG 返回的读数据只带 ID 标识,而这个工程的思路是:发读请求时给每笔请求分配一个递增 tag,通道号拼上 tag 作为 AXI ID,返回的时候解析 ID 就能知道该回给哪个通道、哪笔请求。

地址按 16 字节对齐是刻意设计的——DDR4 的 burst length 为 8 时,一次突发正好是 64 字节(8x8 Byte),而 16 字节对齐保证任意一段数据都能被完整的突发覆盖,不需要跨突发拼接。byte_len 最大 4K 是防止单个描述符占住 MIG 队列太久,影响其他通道的公平性。

3.2 轮询仲裁器:四通道公平调度的 RTL 实现

仲裁器是纯组合逻辑加一个状态位,没有用到复杂算法,但每次仲裁结果要同时送给命令通道和写数据通道,所以握手信号要做得干净。

module arbiter #( parameter CH_NUM = 4, parameter QUEUE_DEPTH = 4 ) ( input logic clk, input logic rst_n, // 各通道命令 FIFO 非空信号 input logic [CH_NUM-1:0] fifo_not_empty, // 各通道命令 FIFO 读使能(仲裁需指挥哪个 FIFO 出数据) output logic [CH_NUM-1:0] fifo_rd_en, // 仲裁结果:当前选中通道 output logic [CH_NUM-1:0] grant, // MIG 命令口握手 input logic mig_cmd_ready, output logic mig_cmd_valid ); logic [$clog2(CH_NUM)-1:0] last_grant; // 上一次仲裁选中通道 // 轮询仲裁:从 last_grant 的下一个通道开始找非空 FIFO always_comb begin grant = '0; for (int i = 0; i < CH_NUM; i++) begin int idx = (last_grant + i + 1) % CH_NUM; if (fifo_not_empty[idx]) begin grant[idx] = 1'b1; break; end end end // 仲裁结果与 MIG 握手信号联动 assign mig_cmd_valid = |grant; assign fifo_rd_en = grant; always_ff @(posedge clk or negedge rst_n) begin if (!rst_n) last_grant <= '0; else if (mig_cmd_valid && mig_cmd_ready) // 命令被 MIG 接收后,更新轮询起点 if (grant[0]) last_grant <= 0; else if (grant[1]) last_grant <= 1; else if (grant[2]) last_grant <= 2; else last_grant <= 3; end endmodule

逻辑说明:grant 信号经过编码后得到选中通道,fifo_rd_en 直接连到各通道命令 FIFO 的读使能。MIG 的 AXI4 命令口是 valid-ready 握手,mig_cmd_valid 拉高的同时必须保证 grant 稳定。注意 last_grant 的更新条件是mig_cmd_valid && mig_cmd_ready,也就是命令真正被 MIG 接收,而不是仲裁器刚送出,否则会漏掉一拍导致仲裁顺序错乱。

参数说明:CH_NUM 表示通道数,扩展成 8 通道只需要改参数并保证 fifo_not_empty 和 grant 的位宽对应。QUEUE_DEPTH 是每个通道命令 FIFO 的深度,工程默认 4,如果单通道突发很多、MIG 响应慢,可以适当加大到 8,代价是 FPGA 里 BRAM 占用略微上升。

这里埋了一个细节:轮询仲裁存在「头堵塞」问题。如果 ch0 的命令 FIFO 一直非空,ch1~ch3 必须等 ch0 发完一笔才能轮到自己。所以命令 FIFO 的深度不能太浅,至少能缓冲一整拍仲裁周期内到达的所有请求,否则高负载下会有通道饿死。工程里让仲裁器在 MIG 没准备好时保持 grant 不变,相当于在命令路径上加了反压,数据通路也跟着反压,这个联动在 3.3 节会看到具体实现。

3.3 写数据通路:多通道数据如何拼到 AXI 总线上

写数据通路的难点在于:命令仲裁的结果要同步到数据路径,通道切换时不能把两个通道的数据混在一笔突发里。做法是给每一笔写数据打上通道标记,由写状态机根据仲裁结果决定当前接收哪个通道的数据。

module wr_data_path #( parameter DATA_WIDTH = 512, parameter CH_NUM = 4 ) ( input logic clk, input logic rst_n, // 各通道写数据输入(FIFO 接口) input logic [CH_NUM-1:0] ch_wr_valid, input logic [CH_NUM*DATA_WIDTH-1:0] ch_wr_data, output logic [CH_NUM-1:0] ch_wr_ready, // 仲裁结果 input logic [CH_NUM-1:0] grant, // MIG AXI 写通道 input logic mig_wready, output logic mig_wvalid, output logic [DATA_WIDTH-1:0] mig_wdata, output logic [5:0] mig_wstrb ); logic [DATA_WIDTH-1:0] wdata_mux; logic [CH_NUM-1:0] selected_onehot; logic wr_active; assign selected_onehot = grant; // 选择当前仲裁通道的数据 always_comb begin wdata_mux = '0; for (int i = 0; i < CH_NUM; i++) begin if (selected_onehot[i]) wdata_mux = ch_wr_data[i*DATA_WIDTH +: DATA_WIDTH]; end end // 握手:只有当前通道有数据且 MIG 准备好时,才真正握手 assign mig_wvalid = |(ch_wr_valid & selected_onehot); assign mig_wdata = wdata_mux; // 示例固定全字节使能,实际可按 byte_len 调整 assign mig_wstrb = 6'h3F; // 写准备好:回给当前仲裁通道 always_comb begin ch_wr_ready = '0; for (int i = 0; i < CH_NUM; i++) begin if (selected_onehot[i] && mig_wready) ch_wr_ready[i] = 1'b1; end end endmodule

逻辑说明:写数据选择器的核心是selected_onehot与ch_wr_valid做与操作,保证只有被仲裁选中的通道数据才能上 MIG 写总线。握手反压是双向的——MIG 的 wready 通过 ch_wr_ready 传给用户通道,用户通道的写入 FIFO 才能弹出数据。如果仲裁切换时上一笔数据还没被 MIG 接收,通道切换不会发生,因为 grant 在 mig_wvalid && mig_wready 之前不会更新。

参数说明:DATA_WIDTH=512 对应 DDR4 颗粒位宽 64 bit 的 8 倍,这是常见的 AXI4 数据宽度。如果颗粒位宽是 16 bit,AXI 数据宽度通常配 128 或 256,mig_wstrb 的位宽也要跟着变(512 位数据对应 64 字节,一般 wstrb 是 64 bit 而不是 6 bit,这里是简化示意,实际工程用的参数表会在第 4 章给出)。

这里有一个容易踩坑的地方:多通道切换时,wvalid 不能有毛刺。因为 wdata_mux 是组合逻辑选出来的,如果 grant 在 wvalid 拉高期间抖动,MIG 会采到半个通道的数据。解决办法是让 grant 只在时钟上升沿改变,并且保证ch_wr_valid & selected_onehot的与门输出在握手前建立稳定,工程里用了一级寄存器打拍来避免组合逻辑直接驱动 AXI 握手信号。

3.4 读返回通路:乱序读数据怎么送回正确的通道

DDR4 的读返回是乱序的,MIG 的 AXI4 接口通过 ID 信号标识每一笔读返回属于哪个请求。这个工程把 AXI ID 的低 2 位直接映射成通道号,高 6 位映射成 tag,这样读返回到达时,通过 ID 解析就能定位到目标通道的读 FIFO。

module rd_data_path #( parameter DATA_WIDTH = 512, parameter CH_NUM = 4 ) ( input logic clk, input logic rst_n, // MIG 读返回接口 input logic mig_rvalid, input logic [DATA_WIDTH-1:0] mig_rdata, input logic [7:0] mig_rid, output logic mig_rready, // 各通道读输出 FIFO 接口 output logic [CH_NUM-1:0] ch_rd_valid, output logic [CH_NUM*DATA_WIDTH-1:0] ch_rd_data, input logic [CH_NUM-1:0] ch_rd_ready ); logic [1:0] ch_id; logic [5:0] tag; assign ch_id = mig_rid[7:6]; // 高 2 位为通道号 assign tag = mig_rid[5:0]; // 低 6 位为请求序号 // 每个通道一个读 FIFO,用 ch_id 选中写入目标 always_ff @(posedge clk) begin if (mig_rvalid && mig_rready) begin case (ch_id) 2'd0: begin if (ch_rd_ready[0]) begin ch_rd_valid[0] <= 1'b1; ch_rd_data[0*DATA_WIDTH +: DATA_WIDTH] <= mig_rdata; end end // ch1~ch3 同理 endcase end end endmodule

逻辑说明:这个模块的关键是通道号从 ID 里解析,而不是从数据内容里提取。读数据不需要仲裁,因为 MIG 已经通过 ID 把数据分好了,模块要做的只是选通和缓冲。tag 可以在验证时用来比对请求与返回的顺序关系,上板调试时也可以把 tag 一起接到 ILA 上,定位数据错位问题。

注意 rvalid 和 rready 的握手同样不能丢。这里用打拍的方式把数据写入对应通道读 FIFO,ch_rd_ready 为低时数据会暂停在当前拍,MIG 的 rready 拉低反压,不会丢数据。这是 AXI 流控的标准做法,但很多第一次调 MIG 的人会漏掉 rready 的反压信号,导致读数据在链路拥堵时丢失,表现为偶发性的读回全 0 或错行数据。

3.5 顶层例化与跨时钟域处理

顶层把 MIG、仲裁器、数据通路串起来,同时处理两个跨时钟域:用户逻辑时钟(通常 200 MHz 以内)和 MIG 用户时钟(出自 MIG IP 的 UI 时钟,频率取决于 DDR4 工作频率和数据位宽)。跨时钟域的同步用的是传统的两级寄存器,没有用异步 FIFO,因为命令和数据的往返都有握手保护,两级同步足够。

// top.v 关键例化片段 mig_7series u_mig ( .sys_clk_i (sys_clk_200m), .ui_clk (mig_ui_clk), .ui_clk_sync_rst (mig_ui_rst), .aresetn (mig_aresetn), // AXI4 从端口 .s_axi_awid (awid), .s_axi_awaddr (awaddr), .s_axi_awlen (awlen), .s_axi_awvalid (awvalid), .s_axi_awready (awready), // ... 其余 AXI 信号省略 .init_calib_complete (calib_done), .ddr4_addr (ddr4_addr), .ddr4_ba (ddr4_ba), .ddr4_cke (ddr4_cke), .ddr4_cs_n (ddr4_cs_n), .ddr4_dq (ddr4_dq), .ddr4_dqs_p (ddr4_dqs_p), .ddr4_dqs_n (ddr4_dqs_n) );

整个设计都跑在 mig_ui_clk 域里,避免用户通道时钟和 MIG 用户时钟不一致带来的跨时钟域问题。如果用户通道本身工作在另一个时钟域,进 arbiter 之前先过异步 FIFO,这是后面二次开发章节会展开的内容。

4. 工程怎么跑:从建工程到仿真再上板

4.1 用 tcl 脚本一键重建 Vivado 工程

拿到源码后,不推荐手动新建工程再一个个添加文件,容易漏掉 IP 配置。工程里带了 create_project.tcl,直接在 Vivado Tcl Console 里执行就能重建完整工程:

cd fpga_ddr4_multi_ch source scripts/create_project.tcl

脚本逻辑是:创建工程 → 添加 src 和 constr 目录下所有文件 → 导入 ip 目录下两个 xci → 应用时序约束 → 生成 bitstream。如果遇到 IP 版本不兼容(比如你的 Vivado 版本和工程创建时不一致),xci 会提示升级 IP,选择 Upgrade 后重新 generate_target 即可。

注意 MIG 的 xci 里固化了器件型号和 DDR4 颗粒参数,换板子时必须重新配置 IP,不能直接沿用。工程默认是 xc7k325t 级别的器件,如果你用的是其他容量的 Kintex-7 或 Artix-7,MIG 的引脚规划要重新跑一次。

4.2 MIG IP 核心参数配置参考

这个工程的 MIG 配置是四通道设计的基础,下面这张表是参数值的参考,换成别的频率和位宽时按对应关系调整:

参数项配置值说明
DDR4 工作频率2400 MT/s(1200 MHz 时钟)频率越高,ui_clk 越高,时序余量越小
UI 时钟频率300 MHz由 MIG 根据数据位宽自动生成
AXI4 数据位宽512 bit对应 64 Byte 每拍,burst=8 时一次突发 4 KB
Burst Length8(固定)DDR4 BL8 是标准配置,不需要改
Bank Group4影响 bank 并行度,4 通道并发时建议保持 4
用户端口数量1(AXI 从端)多通道仲裁在外部实现,MIG 只开一个口
读写仲裁模式读优先或自适应工程里建议自适应,写多时自动调整

开发中常见的误用是把 MIG 的用户端口开成 4 个,让每个通道直连一个端口。看起来省了仲裁逻辑,但 MIG 的多端口模式内部还是共享命令队列,仲裁由 IP 内部完成,你能控制的粒度反而变细了,调试起来像个黑匣子。这个工程选择单端口 + 外部仲裁,就是为了把调度策略握在自己手里。

4.3 仿真流程:跑一个四通道并发读写测试

仿真脚本 run_sim.tcl 会启动 Vivado Simulator,跑一轮 5000 时钟周期的四通道并发读写测试。测试平台里例化了 traffic_gen,每个通道独立产生读写请求,写完立即读回并比对数据。

跑仿真前先确认两个事:一是仿真模型用的是 MIG 的 behavioral model,DDR4 颗粒模型是 xilinx 提供的仿真库,不需要真实硬件;二是复位时序,MIG 的 calib_done 信号拉高前不要发起任何读写请求,否则命令会丢失。测试平台里专门做了一个wait_calib_done的阻塞等待,确保所有通道的请求都是从校准完成后才开始。

仿真结束后看 test_bench.log,最后几行会打出一个汇总,包含每通道的请求数、完成数、错误计数。四通道都对满结果,再往下走:

# 跑完仿真后查看 log grep "TEST_PASS" sim/test_bench.log # 如果看到 TEST_PASS,说明读写一致性和通道隔离都通过

4.4 上板验证:ILA 实测带宽与资源占用

上板的第一步是连接 ILA,工程里已经例化了一个 64 深度的 ILA,挂在 MIG 的 AXI4 命令接口和写数据接口上。ILA 采样深度不用太大,64 足够抓到一个完整的仲裁周期,重点看三件事:mig_cmd_valid 和 mig_cmd_ready 的握手密度(密度越高说明命令队列越不空,带宽利用率越高)、写数据 wdata_mux 切换时 grant 是否稳定、读返回 ID 是否分布在所有通道上。

带宽的实测方法是在固定时间窗口内计数命令接口的握手次数:

// 用 VIO 触发,统计 1ms 窗口内完成的命令数 reg [31:0] cmd_cnt; always_ff @(posedge mig_ui_clk) begin if (mig_cmd_valid && mig_cmd_ready) cmd_cnt <= cmd_cnt + 1; end

假设每笔命令是 64 字节突发,5000 笔命令就是 320 KB,记下耗时就可以算出有效带宽。四通道并发跑到 2400 MT/s 的 DDR4 时,有效带宽能到理论峰值的 70%~80% 就算健康,低于 60% 需要查仲裁策略和 bank 冲突。资源占用方面,四通道设计在 Kintex-7 上通常消耗 12K 左右的 LUT 和 30 个 BRAM(主要是通道 FIFO),MIG IP 本身的资源不包含在内。

5. 避坑与排查:DDR4 调通的四个关键教训

5.1 现象:bitstream 下载后 DDR4 校准一直不过,init_calib_complete 始终为低

原因:大部分情况是引脚约束不对,或者 DDR4 颗粒型号与 MIG IP 里选择的型号不一致。有一次把 MT40A512M16 的颗粒配成了 MT40A256M16,地址位宽少了一位,校准训练时读写数据对不上,卡在写电平校正步骤。

解决:先用 MIG 的报告确认颗粒型号,再逐个核对 xdc 里 ddr4_addr、ddr4_ba、ddr4_dq 等引脚的位置约束。有的开发板把 DQS 和 DQ 的引脚对调,只约束 DQ 不约束 DQS 也能通过综合,但上板校准必挂。遇到校准不过,不要反复重新生成 bitstream,先用 Vivado 的 Hardware Manager 看 MIG 的 calibration 状态寄存器,它能定位到具体卡在哪个训练阶段。

5.2 现象:多通道写数据错位,ch0 写进去的数据读出来跑到 ch1

原因:写数据通路的通道切换逻辑有 bug。仲裁器选中的通道和写数据选择器的通道不是同一拍——grant 信号出现了组合逻辑竞争,数据还在总线上的时候 grant 变了,MIG 把两笔数据当成了同一笔突发。这种问题仿真里不容易复现,因为仿真时钟是理想化的,上板后组合逻辑延时暴露了问题。

解决:给 grant 信号加一级寄存器,保证数据总线和通道选择在同一时钟沿更新。更重要的是,在写状态机里加一个通道切换的等待周期:当 grant 的变化和上一次写数据尚未握手完成时,强制暂停通道切换。这也解释了为什么工程的仲裁器更新条件要严格绑定 mig_cmd_valid && mig_cmd_ready,而不是简单地每时钟周期更新轮询指针。

5.3 现象:偶发的读数据错误,有时候读回的数据中某几个字节是旧数据

原因:MIG 的读返回是 512 位宽,但实际有用的字节数由读请求长度决定。如果读请求的起始地址不是 64 字节对齐,读返回的前面几拍包含无用的字节,处理不当会把无效字节混进有效数据。还有一个原因是读数据的 tag 解析错误,把 tag 当成通道号送回了错误的 FIFO,两个通道的数据交错进同一个缓冲区。

解决:第一,读请求地址必须按 64 字节对齐发起,非对齐的部分在通道适配层先做合并或拆分;第二,tag 的分配和回收要做成环形队列,不能出现复用冲突——tag 用完后必须等对应读返回回来才能重新分配。调试时把 tag 打进 ILA,出现错误的时候直接看 tag 序列有没有跳号或重复。

5.4 现象:系统偶尔出现性能骤降,带宽从 80% 掉到 30%

原因:命令 FIFO 深度不足,轮询仲裁遇到队头阻塞。四个通道如果同时压入长度很大的读突发,一个通道的命令还没发完,其他通道的命令已经在 FIFO 里排队,但仲裁器在前一个通道的突发结束前不会切换,导致排队时间拉长,DDR4 的 bank 也得不到充分利用。

解决:把命令 FIFO 深度从 4 加到 8,并在仲裁器里加一个「突发上限」逻辑——单通道连续发送的突发数达到上限后强制切换到下一个非空通道。这个改法比单纯加深 FIFO 更有效,因为它限制了单个通道对 MIG 命令队列的连续占用时间。上板测试时用 5.4 节提到的命令计数方法,对比改动前后的握手密度就能看到明显差距。

6. 二次开发思路:从四通道扩展到八通道,我改了什么

扩展通道数不是改一个参数那么简单,但也不需要推倒重来。把 CH_NUM 从 4 改成 8,首先要处理的是 AXI ID 的位宽——原来高 2 位做通道号,8 通道需要高 3 位,tag 从 6 位降到 5 位,意味着每通道的 outstanding 请求数减半。这时候有两种路线:如果 32 笔 outstanding 够用就改位宽;不够的话给每个通道增加独立的读数据 FIFO,用 FIFO 深度换 outstanding 数。

仲裁器本身的改动很小,轮询逻辑是参数化的,但要注意一个实际约束:MIG 的单端口 AXI4 命令口在同一时刻只能接受一笔命令,仲裁器的输出从 one-hot 变成编码值后,命令描述符里的 ch_id 直接连过去。写数据通路因为是按 one-hot 展开的 case,改成 8 通道后综合面积会增长,建议把选择逻辑改成编码索引 + 多路选择器,而不是继续用 for 循环展开。

我自己改的时候遇到一个意外问题:8 通道并发时,MIG 的 ui_clk 频率不够支撑所有通道的请求速率,命令 FIFO 排空成了常态。解决办法是改到更高的 DDR4 频率,或者把 MIG 的数据位宽从 512 改成 1024(需要器件支持)。也就是说,通道数翻倍背后还要核对 FPGA 的带宽预算和 MIG 的用户时钟频率能否匹配,不然扩展了通道,带宽瓶颈反而暴露在仲裁器前面。

从那以后我每次做这类多通道控制,都强制先画一张「通道数 - 数据位宽 - 命令队列深度」的预算表,再动 RTL。这块工程量不小,希望这份参考能帮你少走几步弯路。

本文还有配套的精品资源,点击获取

需要专业的网站建设服务?

联系我们获取免费的网站建设咨询和方案报价,让我们帮助您实现业务目标

立即咨询